{"text_format":"1","workbook":"xlsx","n_sheets":3,"sheets":["FUID 2010","FUID 2018","BD2"],"not_rendered":{"charts":0,"images":3,"macros":1,"external_links":1,"defined_names":10,"comments":1,"pivot_tables":0},"unopened":[],"bounds":{"document_bytes":16777216,"sheet_cells":100000,"rows_first":2000,"rows_last":500,"rows_between":2000,"halvings":0,"cell_chars":16384,"cell_head_chars":4096},"cells_cut":0,"cells_raw":0,"read":"whole","date_system":"1900"}

{"sheet":"FUID 2010","index":0,"n_rows":572,"n_cols":32,"rows_kept":572,"cut":false,"hidden":false,"merged":[[571,0,572,21],[5,21,7,21],[6,8,6,10],[6,11,6,13],[6,15,7,15],[6,16,7,16],[6,17,7,17],[6,18,7,18],[5,7,7,7],[5,8,5,13],[5,14,7,14],[5,15,5,18],[5,19,7,19],[5,20,7,20],[4,0,4,6],[4,7,4,16],[4,17,4,21],[5,0,7,0],[5,1,7,1],[5,2,7,2],[5,3,7,3],[5,4,7,4],[5,5,7,5],[5,6,7,6],[0,0,0,1],[0,2,0,21],[1,0,1,21],[2,0,2,21],[3,0,3,6],[3,7,3,16],[3,17,3,21]]}
[null,null,"FORMATO ÚNICO DE INVENTARIO DOCUMENTAL - FUID"]
["DIVISIÓN DE GESTIÓN DOCUMENTAL"]
[]
["Unidad  académica o administrativa",null,null,null,null,null,null,"Dependencia",null,null,null,null,null,null,null,null,null,"Archivo de gestión"]
["SECRETARIA GENERAL",null,null,null,null,null,null,"DIVISION DE GESTIÓN DOCUMENTAL"]
["No. consecutivo","Centro de costos","Código de  serie ","Nombre de la serie","Código de  subserie ","Nombre de la subserie ","Nombre del expediente","Código expediente","Fechas extremas",null,null,null,null,null,"Número de paginas","Unidad de conservación",null,null,null,"Soporte","Ubicación física","Observaciones"]
[null,null,null,null,null,null,null,null,"Fecha Inicial ",null,null,"Fecha final",null,null,null,"Carpeta","Tomo","Otro","Estado"]
[null,null,null,null,null,null,null,null,"D","M","A","D","M","A"]
[1,21340005,{"$f":"IFERROR(VLOOKUP(D9,CodSerie2010,2,FALSE),\"\")","v":"08"},"CONTRATOS",{"$f":"IFERROR(VLOOKUP(F9,CodSubserie2010,2,FALSE),\"\")","v":"15"},"08-15   CONTRATOS INTERADMINISTRATIVOS","Contrato interadministrativo No. 0070 – 2013 Fondo Nacional de financiamiento para la ciencia, la tecnología y la innovación Francisco José de Caldas","COL 13-1-12","3","Julio","2012","28","Junio","2017",140,"x",null,null,"Inactivo / Transferencia","Físico"]
[2,21340005,"08","CONTRATOS","15","08-15   CONTRATOS INTERADMINISTRATIVOS","Contrato interadministrativo No. 0199 – 2013 Fondo Nacional de financiamiento para la ciencia, la tecnología y la innovación Francisco José de Caldas","COL 13-1-09","19","Julio","2012","7","Marzo","2017",111,"x",null,null,"Inactivo / Transferencia","Físico"]
[3,21340005,"08","CONTRATOS","15","08-15   CONTRATOS INTERADMINISTRATIVOS","Contrato interadministrativo No. 0176 – 2013 Fondo Nacional de financiamiento para la ciencia, la tecnología y la innovación Francisco José de Caldas","COL 13-1-11","19","Julio","2012","18","Noviembre","2016",124,"x",null,null,"Inactivo / Transferencia","Físico"]
[5,21340005,"09","CONVENIOS","07","09-07   CONVENIOS INTERADMINISTRATIVOS","Convenio interadministrativo -la universitat autónoma de Barcelona (UAB) ","COL13-1-05","3","Marzo","2016","3","Marzo","2016",4,null,null,null,"Inactivo / Transferencia","Físico y electrónico"]
[6,21340005,"08","CONTRATOS","15","08-15   CONTRATOS INTERADMINISTRATIVOS","Contrato interadministrativo No. 0589 – 2013 Fondo Nacional de financiamiento para la ciencia, la tecnología y la innovación Francisco José de Caldas","COL13-2-20","12","Junio","2013","30","Mayo","2017",175,"x",null,null,"Inactivo / Transferencia","Físico"]
[7,21340005,"09","CONVENIOS","07","09-07   CONVENIOS INTERADMINISTRATIVOS","convenio interadministrativo 226 de 2014 unidad de planeación energética ","COL13-2-21","","","","","","",5,"x",null,null,"Inactivo / Transferencia","Físico"]
[8,21340005,"08","CONTRATOS","15","08-15   CONTRATOS INTERADMINISTRATIVOS","Contrato interadministrativo No. 0068 – 2013 Fondo Nacional de financiamiento para la ciencia, la tecnología y la innovación Francisco José de Caldas","COL13-1-13","19","Julio","2012","4","Noviembre","2016",137,"x",null,null,"Inactivo / Transferencia","Físico"]
[9,21340005,"08","CONTRATOS",null,"08-15   CONTRATOS INTERADMINISTRATIVOS","Contrato interadministrativo No. 0975 – 2012 Fondo Nacional de financiamiento para la ciencia, la tecnología y la innovación Francisco José de Caldas","COL13-1-08","6","Diciembre","2012","11","Mayo","2017",135,"x",null,null,"Inactivo / Transferencia","Físico y electrónico"]
[10,21340005,"08","CONTRATOS",null,"08-15   CONTRATOS INTERADMINISTRATIVOS","Contrato interadministrativo No. 0200 – 2013 Fondo Nacional de financiamiento para la ciencia, la tecnología y la innovación Francisco José de Caldas","COL13-1-14","1","Marzo","2012","13","Abril","2016",128,"x",null,null,"Inactivo / Transferencia","Físico"]
[11,21340005,"08","CONTRATOS",null,"08-15   CONTRATOS INTERADMINISTRATIVOS","Contrato interadministrativo No. 0940 – 2012 Fondo Nacional de financiamiento para la ciencia, la tecnología y la innovación Francisco José de Caldas","COL13-1-04","23","Mayo","2012","8","Agosto","2017",102,"x",null,null,"Inactivo / Transferencia","Físico"]
[13,21340005,"08","CONTRATOS",null,"08-07   CONTRATOS DE FINANCIACIÓN ","Contrato de financiación No. 458 – 2009 Colciencias ","COL09-1-02","2","Octubre","2009","12","Diciembre","2016",87,"x",null,null,"Inactivo / Transferencia","Físico"]
[14,21340005,"08","CONTRATOS",null,"08-15   CONTRATOS INTERADMINISTRATIVOS","Contrato interadministrativo No. 0283 – 2014 Fondo Nacional de financiamiento para la ciencia, la tecnología y la innovación Francisco José de Caldas","COL14-2-03","21","Agosto","2014","9","Noviembre","2016",79,null,null,null,"Inactivo / Transferencia","Físico"]
{"$rows_left_out":553}
{"sheet":"FUID 2018","index":1,"n_rows":543,"n_cols":32,"rows_kept":543,"cut":false,"hidden":false,"merged":[[542,0,543,21],[0,0,0,1],[5,0,7,0],[5,1,7,1],[5,2,7,2],[5,3,7,3],[5,4,7,4],[5,5,7,5],[5,6,7,6],[5,7,7,7],[5,8,5,13],[5,14,7,14],[6,11,6,13],[6,8,6,10],[0,2,0,21],[1,0,1,21],[5,21,7,21],[5,15,5,18],[5,20,7,20],[6,15,7,15],[6,16,7,16],[6,17,7,17],[6,18,7,18],[5,19,7,19],[2,0,2,21],[3,0,3,6],[4,0,4,6],[3,7,3,16],[4,7,4,16],[3,17,3,21],[4,17,4,21]]}
[null,null,"FORMATO ÚNICO DE INVENTARIO DOCUMENTAL - FUID"]
["DIVISIÓN DE GESTIÓN DOCUMENTAL"]
[]
["Unidad  académica o administrativa",null,null,null,null,null,null,"Dependencia",null,null,null,null,null,null,null,null,null,"Archivo de gestión"]
["SECRETARÍA GENERAL"]
["No. consecutivo","Código Dependencia OnBase","Código de  serie ","Nombre de la serie","Código de  subserie ","Nombre de la subserie ","Nombre del expediente","Código expediente","Fechas extremas",null,null,null,null,null,"Número de paginas","Unidad de conservación",null,null,null,"Soporte","Ubicación física","Observaciones"]
[null,null,null,null,null,null,null,null,"Fecha Inicial ",null,null,"Fecha final",null,null,null,"Carpeta","Tomo","Otro","Estado"]
[null,null,null,null,null,null,null,null,"D","M","A","D","M","A"]
[4,{"$f":"IF(C9<>\"\",(IFERROR(VLOOKUP($A$5,CodDepOnBase,2,1),\" \")),\"\")","v":"10500"},{"$f":"IFERROR(VLOOKUP(D9,'BD2'!V2:W33,2,0),\"\")","v":"08"},"CONTRATOS",{"$f":"IFERROR(VLOOKUP(F9,CodSubserie2018,2,0),\"\")","v":"08 "},"08.08 CONTRATOS DE ENCARGO FIDUCIARIO","Contrato interadministrativo No. 0976 – 2012 Fondo Nacional de financiamiento para la ciencia, la tecnología y la innovación Francisco José de Caldas","COL13-1-05","17","Diciembre","2012","26","Abril","2018",156,"x",null,null,"Inactivo / Transferencia","Físico y electrónico"]
[12,"10500",{"$f":"IFERROR(VLOOKUP(D10,'BD2'!V3:W34,2,0),\"\")","v":"08"},"CONTRATOS","19 ","08.19 CONTRATOS INTERADMINISTRATIVOS","Contrato de financiación No. 437 – 2013 Colciencias ","COL13-2-18","17","Julio","2012","5","Julio","2018",227,"x",null,null,"Inactivo / Transferencia","Físico y electrónico"]
[18,"10500",{"$f":"IFERROR(VLOOKUP(D11,'BD2'!V4:W35,2,0),\"\")","v":"27"},"PROYECTOS","04 ","27.04 PROYECTOS DE INVESTIGACIÓN","Desarrollo de un bioreactor prototipo de lecho fijo para el tratamiento de efluentes industriales textiles","FIT13-1-01","26","Noviembre","2012","28","Septiembre","2018",89,"x",null,null,"Inactivo / Transferencia","Físico y electrónico"]
[22,"10500",{"$f":"IFERROR(VLOOKUP(D12,'BD2'!V5:W36,2,0),\"\")","v":"08"},"CONTRATOS","19 ","08.19 CONTRATOS INTERADMINISTRATIVOS","Contrato de prestación de servicios No. 2017.10.003.020.167 municipio de la Ceja Tambo","EDNOF17-544","23","Junio","2017","5","Junio","2018",14,"x",null,null,"Inactivo / Transferencia","Físico"]
[23,"10500",{"$f":"IFERROR(VLOOKUP(D13,'BD2'!V6:W37,2,0),\"\")","v":"08"},"CONTRATOS","19 ","08.19 CONTRATOS INTERADMINISTRATIVOS","Contrato de prestación de servicios No. 21340003-017-2017 MAPEI Colombia","EDNOF17-541","5","Junio","2017","16","Mayo","2018",7,"x",null,null,"Inactivo / Transferencia","Físico"]
[25,"10500",{"$f":"IFERROR(VLOOKUP(D14,'BD2'!V8:W38,2,0),\"\")","v":"09"},"CONVENIOS","02 ","09.02 CONVENIOS DE COOPERACIÓN","convenio de cooperación 21340003-015-2017 mantonline S.A.S. ","EDNOF17-543","01","Junio","2017","13","Julio","2018",9,"x",null,null,"Inactivo / Transferencia","Físico"]
[26,null,null,"CONTRATOS",null,"08.19 CONTRATOS INTERADMINISTRATIVOS","Contrato de prestación de servicios No. 21340003-007-2017 NEW STETIC S.A","EDNOF17-524","08","Marzo","2017","16","Mayo","2018",12,"x",null,null,"Inactivo / Transferencia","Físico"]
[27,null,null,"CONTRATOS",null,"08.19 CONTRATOS INTERADMINISTRATIVOS","Contrato interadministrativo No. 21340003-014-2017 CORPORACIÓN PARA INVESTIGACIONES BIOLÓGICAS-CIB","EDNOF17-537","23","Mayo","2017","16","Mayo","2018",7,"x",null,null,"Inactivo / Transferencia","Físico"]
[28,null,null,"CONTRATOS",null,"08.19 CONTRATOS INTERADMINISTRATIVOS","Contrato de prestación de servicios No. 21340003-025-2017 Municipio de Sonsón","EDNOF17-528","24","Marzo","2017","10","Abril","2018",7,"x",null,null,"Inactivo / Transferencia","Físico"]
[29,null,null,"CONTRATOS",null,"08.19 CONTRATOS INTERADMINISTRATIVOS","Contrato de prestación de servicios No. 21340003-003-2017 Aseo y sostenimiento y compañía S.A.","EDNOF17-515","6","Febrero","2017","16","Mayo","2018",12,"x",null,null,"Inactivo / Transferencia","Físico"]
[30,null,null,"CONTRATOS",null,"08.19 CONTRATOS INTERADMINISTRATIVOS","Contrato de prestación de servicios No. 21340003-001-2017 transformadores SUNTEC","EDNOF17-514","18","Enero ","2017","16","Mayo","2018",7,"x",null,null,"Inactivo / Transferencia","Físico"]
[31,null,null,"CONVENIOS",null,"09.02 CONVENIOS DE COOPERACIÓN","convenio de cooperación 21330002-005-208 MASBIO CONSTRUCCIONES S.A.S",null,"21","Junio","2018","21","Junio","2018",6,"x",null,null,"Inactivo / Transferencia","Físico"]
{"$rows_left_out":524}
{"sheet":"BD2","index":2,"n_rows":210,"n_cols":33,"rows_kept":210,"cut":false,"hidden":true,"merged":[]}
["IdDependenciaVersión","Estado","Descripción-2010","IdDependencia","IdSipe","Versión","Publicado","Año",null,{"$f":"+[1]Hoja2!A1","v":"IdDependenciaVersión"},{"$f":"+[1]Hoja2!B1","v":"Estado"},"Descripción-2018","IdDependencia","Año",null,"Nombre de la Serie:2010","Cód. Serie",null,"Cód. Subserie:","Nombre de la subserie:- 2010","Cód. Subserie:","SERIE -2018","COD_SERIE","NombreSubserie 2018","COD_SERIE","COD_SUBSERIE",null,"Estado","Soporte",null,"Dias","Mes","Años"]
["1080-1","ACTIVO","AUDITORIA INSTITUCIONAL",1080,null,1,"SI",2010,null,{"$f":"+[1]Hoja2!A2","v":"10000-1"},{"$f":"+[1]Hoja2!B2","v":"ACTIVO"},"CENTRO DE EXTENSIÓN ACADÉMICA FACULTAD DE ENFERMERÍA","12311",2018,null,"ACTAS","01","01-01   ACTAS DE ASAMBLEA ",{"$f":"MID(R2,4,2)","v":"01"},"ACTAS DE ASAMBLEA ","01-01","ACCIONES CONSTITUCIONALES","01","01.01 ACCIONES DE CUMPLIMIENTO","01 ",{"$f":"MID(X2,1,6)","v":"01.01 "},null,"Activo","Físico",null,1,"Enero ",1990]
["3145-1","ACTIVO","BIBLIOTECA ESCUELA DE BIBLIOTECOLOGIA",3145,null,1,"SI",2010,null,{"$f":"+[1]Hoja2!A3","v":"10100-1"},{"$f":"+[1]Hoja2!B3","v":"ACTIVO"},"CENTRO DE EXTENSIÓN DE IDIOMAS","13102",2018,null,"ACUERDOS","02","01-02   ACTAS DE COMITÉS","02","ACTAS DE COMITÉS","01-02","ACTAS","02","01.02 ACCIONES DE GRUPO","02 ","01.02 ",null,"Inactivo / Transferencia","Electrónico",null,2,"Febrero",1991]
["8826-1","ACTIVO","CENTRO DE ESTUDIOS DE OPINION CEO",8826,null,1,"SI",2010,null,{"$f":"+[1]Hoja2!A4","v":"10101-1"},{"$f":"+[1]Hoja2!B4","v":"ACTIVO"},"CENTRO DE EXTENSIÓN FACULTAD DE MEDICINA","12402",2018,null,"CALIFICACIONES","03","01-03   ACTAS DE CONSEJO ACADÉMICO","03","ACTAS DE CONSEJO ACADÉMICO","01-03","ACUERDOS DE CONSEJO","03","01.03 ACCIONES DE HABEAS DATA","03 ","01.03 ",null,"Inactivo / Eliminación","Físico y electrónico",null,3,"Marzo",1992]
["8521-1","ACTIVO","CENTRO DE EXTENSION FACULTAD DE COMUNICACIONES",8521,null,1,"SI",2010,null,{"$f":"+[1]Hoja2!A5","v":"10102-1"},{"$f":"+[1]Hoja2!B5","v":"ACTIVO"},"CENTRO DE EXTENSIÓN FACULTAD NACIONAL DE SALUD PUBLICA","11904",2018,null,"CERTIFICADOS","04","01-04   ACTAS DE CONSEJO DE CORPORACION","04","ACTAS DE CONSEJO DE CORPORACION","01-04","CIRCULARES INFORMATIVAS","04","01.04 ACCIONES DE TUTELA","04 ","01.04 ",null,null,null,null,4,"Abril",1993]
["3254-1","ACTIVO","CENTRO DE EXTENSION FACULTAD NACIONAL DE SALUD PUBLICA",3254,null,1,"SI",2010,null,{"$f":"+[1]Hoja2!A6","v":"10200-1"},{"$f":"+[1]Hoja2!B6","v":"ACTIVO"},"CENTRO DE EXTENSIÓN, PROMOCIÓN Y DIVULGACIÓN ARTÍSTICAS Y CULTURAL","11404",2018,null,"COMPROBANTES CONTABLES","05","01-05   ACTAS DE CONSEJO DE ESCUELA","05","ACTAS DE CONSEJO DE ESCUELA","01-05","COMPROBANTES CONTABLES","05","01.05 ACCIONES POPULARES","05 ","01.05 ",null,null,null,null,5,"Mayo",1994]
["1026-1","ACTIVO","CENTRO DE INSTRUMENTACION INTERFACULTADES",1026,null,1,"SI",2010,null,{"$f":"+[1]Hoja2!A7","v":"10201-1"},{"$f":"+[1]Hoja2!B7","v":"ACTIVO"},"CENTRO DE INVESTIGACIÓN FACULTAD DE CIENCIAS EXACTAS Y NATURALES","11505",2018,null,"COMUNICACIONES OFICIALES","06","01-06   ACTAS DE CONSEJO DE FACULTAD","06","ACTAS DE CONSEJO DE FACULTAD","01-06","CONCEPTOS JURIDICOS","06","02.02 ACTAS DE COMITÉ","02 ","02.02 ",null,null,null,null,6,"Junio",1995]
["3310-1","ACTIVO","CENTRO DE INVESTIGACIONES AGRARIAS ",3310,null,1,"SI",2010,null,{"$f":"+[1]Hoja2!A8","v":"10300-1"},{"$f":"+[1]Hoja2!B8","v":"ACTIVO"},"CENTRO DE INVESTIGACIÓN FACULTAD NACIONAL DE SALUD PÚBLICA","11903",2018,null,"CONCEPTOS","07","01-07   ACTAS DE CONSEJO DE INSTITUTO","07","ACTAS DE CONSEJO DE INSTITUTO","01-07","CONCILIACIONES BANCARIAS","07","02.04 ACTAS DE JUNTA","04 ","02.04 ",null,null,null,null,7,"Julio",1996]
["8702-1","ACTIVO","CENTRO DE INVESTIGACIONES CIENCIAS EXACTAS Y NATURALES CIEN",8702,null,1,"SI",2010,null,{"$f":"+[1]Hoja2!A9","v":"10301-1"},{"$f":"+[1]Hoja2!B9","v":"ACTIVO"},"CENTRO DE INVESTIGACIÓN Y EXTENSIÓN ESCUELA DE IDIOMAS","13002",2018,null,"CONTRATOS","08","01-08   ACTAS DE CONSEJO SUPERIOR UNIVERSITARIO","08","ACTAS DE CONSEJO SUPERIOR UNIVERSITARIO","01-08","CONTRATOS","08","02.03 ACTAS DE CONSEJO","03 ","02.03 ",null,null,null,null,8,"Agosto",1997]
["3125-1","ACTIVO","CENTRO DE INVESTIGACIONES ECONOMICAS",3125,null,1,"SI",2010,null,{"$f":"+[1]Hoja2!A10","v":"10302-1"},{"$f":"+[1]Hoja2!B10","v":"ACTIVO"},"CENTRO DE INVESTIGACIONES  FACULTAD DE CIENCIAS AGRARIAS","11604",2018,null,"CONVENIOS","09","01-09   ACTAS DE FONDOS","09","ACTAS DE FONDOS","01-09","CONVENIOS","09","02.01 ACTAS DE ASAMBLEA","01 ","02.01 ",null,null,null,null,9,"Septiembre",1998]
["3137-1","ACTIVO","CENTRO DE INVESTIGACIONES EDUCATIVAS Y PEDAGOGICAS",3137,null,1,"SI",2010,null,{"$f":"+[1]Hoja2!A11","v":"10400-1"},{"$f":"+[1]Hoja2!B11","v":"ACTIVO"},"CENTRO DE INVESTIGACIONES AMBIENTALES Y DE INGENIERÍA FACUTAD DE INGENIERÍA","12310",2018,null,"DECLARACIONES","10","01-10   ACTAS DE GRADO","10","ACTAS DE GRADO","01-10","DECLARACIONES TRIBUTARIAS","10","03.00 ACUERDOS DE CONSEJO","00 ","03.00 ",null,null,null,null,10,"Octubre",1999]
["8721-1","ACTIVO","CENTRO DE INVESTIGACIONES EN ALIMENTACION Y NUTRICION CIAN ",8721,null,1,"SI",2010,null,{"$f":"+[1]Hoja2!A12","v":"10401-1"},{"$f":"+[1]Hoja2!B12","v":"ACTIVO"},"CENTRO DE INVESTIGACIONES EDUCATIVAS Y PEDAGÓGICAS  FACULTAD DE EDUCACIÓN","12106",2018,null,"EVENTOS ","11","01-11   ACTAS DE JUNTAS ","11","ACTAS DE JUNTAS ","01-11","ESTADOS FINANCIEROS","11","04.00 CIRCULARES INFORMATIVAS","00 ","04.00 ",null,null,null,null,11,"Noviembre",2000]
["8713-1","ACTIVO","CENTRO DE INVESTIGACIONES EN CIENCIA DE LA INFORMACION",8713,null,1,"SI",2010,null,{"$f":"+[1]Hoja2!A13","v":"10402-1"},{"$f":"+[1]Hoja2!B13","v":"ACTIVO"},"CENTRO DE INVESTIGACIONES EN CIENCIAS DE LA INFORMACIÓN ESCUELA INTERAMERICANA DE BIBLIOTECOLOGIA","12902",2018,null,"GUIONES ","12","01-12   ACTAS DE JURADOS","12","ACTAS DE JURADOS","01-12","ESTUDIOS TÉCNICOS","12","05.01 COMPROBANTES CONTABLES DE AJUSTE","01 ","05.01 ",null,null,null,null,12,"Diciembre",2001]
["3146-1","ACTIVO","CENTRO DE INVESTIGACIONES EN CIENCIAS DE LA INFORMACION",3146,null,1,"SI",2010,null,{"$f":"+[1]Hoja2!A14","v":"10403-1"},{"$f":"+[1]Hoja2!B14","v":"ACTIVO"},"CENTRO DE INVESTIGACIONES FACULTAD DE CIENCIAS FARMACÉUTICAS Y ALIMENTARIAS","12603",2018,null,"HISTORIAS","13","01-13   ACTAS DE REUNIONES","13","ACTAS DE REUNIONES","01-13","GUIONES MUSEOLÓGICOS","13","05.02 COMPROBANTES CONTABLES DE EGRESO","02 ","05.02 ",null,null,null,null,13,null,2002]
["3162-1","ACTIVO","CENTRO DE INVESTIGACIONES EN CIENCIAS DEL DEPORTE",3162,null,1,"SI",2010,null,{"$f":"+[1]Hoja2!A15","v":"10404-1"},{"$f":"+[1]Hoja2!B15","v":"ACTIVO"},"CENTRO DE INVESTIGACIONES FACULTAD DE DERECHO Y CIENCIAS POLITICAS","11803",2018,null,"INFORMES ","14","02-01   ACUERDOS DE CONSEJO ACADÉMICO ","01","ACUERDOS DE CONSEJO ACADÉMICO ","02-01","HISTORIAS","14","05.03 COMPROBANTES CONTABLES DE INGRESO","03 ","05.03 ",null,null,null,null,14,null,2003]
["3515-1","ACTIVO","CENTRO DE INVESTIGACIONES EN CIENCIAS EXACTAS Y NATURALES",3515,null,1,"SI",2010,null,{"$f":"+[1]Hoja2!A16","v":"10405-1"},{"$f":"+[1]Hoja2!B16","v":"ACTIVO"},"CENTRO DE INVESTIGACIONES FACULTAD DE ENFERMERIA","12204",2018,null,"INSTRUMENTOS DE CONTROL","15","02-02   ACUERDOS DE CONSEJO DE CORPORACIÓN","02","ACUERDOS DE CONSEJO DE CORPORACIÓN","02-02","HISTORIALES","15","06.00 CONCEPTOS JURIDICOS","00 ",{"$f":"MID(X16,1,6)","v":"06.00 "},null,null,null,null,15,null,2004]
["3115-1","ACTIVO","CENTRO DE INVESTIGACIONES EN DERECHO",3115,null,1,"SI",2010,null,{"$f":"+[1]Hoja2!A17","v":"10500-1"},{"$f":"+[1]Hoja2!B17","v":"ACTIVO"},"CENTRO DE INVESTIGACIONES Y CIENCIAS DEL DEPORTE INSTITUTO DE EDUCACIÓN FÍSICA Y DEPORTE","13203",2018,null,"INVENTARIOS","16","02-03   ACUERDOS DE CONSEJO DE ESCUELA","03","ACUERDOS DE CONSEJO DE ESCUELA","02-03","INFORMES","16","07.00 CONCILIACIONES BANCARIAS","00 ","07.00 ",null,null,null,null,16,null,2005]
["3269-1","ACTIVO","CENTRO DE INVESTIGACIONES FACULTAD DE ENFERMERIA",3269,null,1,"SI",2010,null,{"$f":"+[1]Hoja2!A18","v":"10501-1"},{"$f":"+[1]Hoja2!B18","v":"ACTIVO"},"CENTRO DE INVESTIGACIONES Y CONSULTORÍAS FACULTAD DE CIENCIAS ECONÓMICAS","12005",2018,null,"LIBROS CONTABLES","17","02-04   ACUERDOS DE CONSEJO DE FACULTAD","04","ACUERDOS DE CONSEJO DE FACULTAD","02-04","INSTRUMENTOS ARCHIVÍSTICOS","17","08.01 CONTRATOS DE ARRENDAMIENTO","01 ","08.01 ",null,null,null,null,17,null,2006]
["3244-1","ACTIVO","CENTRO DE INVESTIGACIONES FACULTAD DE QUIMICA FARMACEUTICA",3244,null,1,"SI",2010,null,{"$f":"+[1]Hoja2!A19","v":"10502-1"},{"$f":"+[1]Hoja2!B19","v":"ACTIVO"},"CENTRO DE INVESTIGACIONES Y EXTENSIÓN ACADÉMICA FACULTAD DE ODONTOLOGIA","12703",2018,null,"MANUALES ","18","02-05   ACUERDOS DE CONSEJO DE INSTITUTO","05","ACUERDOS DE CONSEJO DE INSTITUTO","02-05","INSTRUMENTOS DE CONTROL","18","08.02 CONTRATOS DE CESIÓN DE DERECHOS","02 ","08.02 ",null,null,null,null,18,null,2007]
["3255-1","ACTIVO","CENTRO DE INVESTIGACIONES FACULTAD NACIONAL DE SALUD PUBLICA",3255,null,1,"SI",2010,null,{"$f":"+[1]Hoja2!A20","v":"10600-1"},{"$f":"+[1]Hoja2!B20","v":"ACTIVO"},"CENTRO DE INVESTIGACIONES Y EXTENSIÓN ESCUELA DE NUTRICIÓN Y DIETÉTICA","12802",2018,null,"PLANES ","19","02-06   ACUERDOS DE CONSEJO SUPERIOR UNIVERSITARIO ","06","ACUERDOS DE CONSEJO SUPERIOR UNIVERSITARIO ","02-06","INVENTARIOS","19","08.03 CONTRATOS DE COMODATO","03 ","08.03 ",null,null,null,null,19,null,2008]
{"$rows_left_out":190}